Reaction Details
TargetBeta-1 adrenergic receptor
LigandBDBM82491
Substrate/Competitorn/a
Ki 31.62±n/a nM
CommentsPDSP_1872
Citation Fraundorfer, PFFertel, RHMiller, DDFeller, DR Biochemical and pharmacological characterization of high-affinity trimetoquinol analogs on guinea pig and human beta adrenergic receptor subtypes: evidence for partial agonism. J Pharmacol Exp Ther270:665-74 (1994) Beta-1 adrenergic receptor
Name:Beta-1 adrenergic receptor
Type:Enzyme Catalytic Domain
Mol. Mass.:50540.48
Organism:GUINEA PIG
Description:adrenergic Beta1 ADRB1 GUINEA PIG::B0FL73
Residue:467
BDBM82491
NameBDBM82491
Synonyms:TMQ, 3'-Nitro
TypeSmall organic molecule
Emp. Form.C18H20N2O6
Mol. Mass.360.3612
SMILESCOc1cc(CC2NCCc3cc(O)c(O)cc23)cc(c1OC)[N+]([O-])=O