Reaction Details
TargetBeta-1 adrenergic receptor
LigandBDBM82503
Substrate/Competitorn/a
Ki 5.37±n/a nM
CommentsPDSP_1891
Citation Fraundorfer, PFFertel, RHMiller, DDFeller, DR Biochemical and pharmacological characterization of high-affinity trimetoquinol analogs on guinea pig and human beta adrenergic receptor subtypes: evidence for partial agonism. J Pharmacol Exp Ther270:665-74 (1994) Beta-1 adrenergic receptor
Name:Beta-1 adrenergic receptor
Type:G Protein-Coupled Receptor (GPCR)
Mol. Mass.:51338.40
Organism:Homo sapiens (Human)
Description:P08588
Residue:477
BDBM82503
NameBDBM82503
Synonyms:CAS_65772 TMQ, S-(-)
TypeSmall organic molecule
Emp. Form.C19H23NO5
Mol. Mass.345.3896
SMILESCOc1cc(C[C@@H]2NCCc3cc(O)c(O)cc23)cc(OC)c1OC