Reaction Details
TargetBeta-2 adrenergic receptor
LigandBDBM82487
Substrate/Competitorn/a
Ki 0.58±n/a nM
CommentsPDSP_1869
Citation Fraundorfer, PFFertel, RHMiller, DDFeller, DR Biochemical and pharmacological characterization of high-affinity trimetoquinol analogs on guinea pig and human beta adrenergic receptor subtypes: evidence for partial agonism. J Pharmacol Exp Ther270:665-74 (1994) Beta-2 adrenergic receptor
Name:Beta-2 adrenergic receptor
Type:n/a
Mol. Mass.:46461.69
Organism:Homo sapiens (Human)
Description:P07550
Residue:413
BDBM82487
NameBDBM82487
Synonyms:TMQ, 3',5'-Diiodo
TypeSmall organic molecule
Emp. Form.C17H17I2NO3
Mol. Mass.537.1307
SMILESCOc1c(I)cc(CC2NCCc3cc(O)c(O)cc23)cc1I