Reaction Details
TargetBeta-2 adrenergic receptor
LigandBDBM82482
Substrate/Competitorn/a
Ki 33.11±n/a nM
CommentsPDSP_1892
Citation Fraundorfer, PFFertel, RHMiller, DDFeller, DR Biochemical and pharmacological characterization of high-affinity trimetoquinol analogs on guinea pig and human beta adrenergic receptor subtypes: evidence for partial agonism. J Pharmacol Exp Ther270:665-74 (1994) Beta-2 adrenergic receptor
Name:Beta-2 adrenergic receptor
Type:Enzyme Catalytic Domain
Mol. Mass.:46993.24
Organism:GUINEA PIG
Description:adrenergic Beta2 ADRB2 GUINEA PIG::Q8K4Z4
Residue:418
BDBM82482
NameBDBM82482
Synonyms:TMQ, S-(+)-8-Fluoro
TypeSmall organic molecule
Emp. Form.C19H22FNO5
Mol. Mass.363.3801
SMILESCOc1cc(C[C@@H]2NCCc3cc(O)c(O)c(F)c23)cc(OC)c1OC