Reaction Details
TargetHistamine H1 receptor
LigandBDBM22893
Substrate/Competitorn/a
Ki>10000±n/a nM
CommentsPDSP_1588
Citation Moguilevsky, NVarsalona, FNoyer, MGillard, MGuillaume, JPGarcia, LSzpirer, CSzpirer, JBollen, A Stable expression of human H1-histamine-receptor cDNA in Chinese hamster ovary cells. Pharmacological characterisation of the protein, tissue distribution of messenger RNA and chromosomal localisation of the gene. Eur J Biochem224:489-95 (1994) 
 
Histamine H1 receptor
Name:Histamine H1 receptor
Type:G Protein-Coupled Receptor (GPCR)
Mol. Mass.:55808.72
Organism:Homo sapiens (Human)
Description:Cell pellets from SK-N-MC cells transfected with human H1 receptor were used in binding assay.
Residue:487
BDBM22893
NameBDBM22893
Synonyms:CHEMBL512 ZANTAC | dimethyl[(5-{[(2-{[(E)-1-(methylamino)-2-nitroethenyl]amino}ethyl)sulfanyl]methyl}furan-2-yl)methyl]amine
TypeSmall organic molecule
Emp. Form.C13H22N4O3S
Mol. Mass.314.404
SMILESCN\C([CH-][N+]([O-])=O)=[NH+]/CCSCc1ccc(CN(C)C)o1