Reaction Details
TargetDelta-type opioid receptor
LigandBDBM82507
Substrate/Competitorn/a
Ki 1000±n/a nM
CommentsPDSP_1
Citation Standifer, KMCheng, JBrooks, AIHonrado, CPSu, WVisconti, LMBiedler, JLPasternak, GW Biochemical and pharmacological characterization of mu, delta and kappa 3 opioid receptors expressed in BE(2)-C neuroblastoma cells. J Pharmacol Exp Ther270:1246-55 (1994) Delta-type opioid receptor
Name:Delta-type opioid receptor
Type:G Protein-Coupled Receptor (GPCR)
Mol. Mass.:40382.98
Organism:Homo sapiens (Human)
Description:Competition binding assays were carried out using membrane preparations from transfected HN9.10 cells that constitutively expressed the delta opioid receptor.
Residue:372
BDBM82507
NameBDBM82507
Synonyms:(+/-)-Methadone METHADONE NSC_22266
TypeSmall organic molecule
Emp. Form.C21H27NO
Mol. Mass.309.4452
SMILESCCC(=O)C(CC(C)N(C)C)(c1ccccc1)c1ccccc1