Reaction Details
TargetMelatonin receptor type 1B
LigandBDBM82509
Substrate/Competitorn/a
Ki 2±n/a nM
CommentsPDSP_1197
Citation Reppert, SMWeaver, DREbisawa, T Cloning and characterization of a mammalian melatonin receptor that mediates reproductive and circadian responses. Neuron13:1177-85 (1994) 
 
Melatonin receptor type 1B
Name:Melatonin receptor type 1B
Type:Enzyme
Mol. Mass.:40203.54
Organism:Homo sapiens (Human)
Description:P49286
Residue:362
BDBM82509
NameBDBM82509
Synonyms:Melatonin,6-Hydroxy | melatonin, 6-Hydroxy
TypeSmall organic molecule
Emp. Form.C13H16N2O3
Mol. Mass.248.2777
SMILESCOc1cc2c(CCNC(C)=O)c[nH]c2cc1O