Reaction Details
Target5-hydroxytryptamine receptor 1A
LigandBDBM50020192
Substrate/Competitorn/a
Ki 1±n/a nM
CommentsPDSP_1743
Citation Boess, FGMartin, IL Molecular biology of 5-HT receptors. Neuropharmacology33:275-317 (1994) 
 
5-hydroxytryptamine receptor 1A
Name:5-hydroxytryptamine receptor 1A
Type:n/a
Mol. Mass.:46122.49
Organism:Homo sapiens (Human)
Description:n/a
Residue:422
BDBM50020192
NameBDBM50020192
Synonyms:8-(2,3-Dihydro-benzo[1,4]dioxin-2-ylmethyl)-1-phenyl-1,3,8-triaza-spiro[4.5]decan-4-one Spiroxatrine
TypeSmall organic molecule
Emp. Form.C22H25N3O3
Mol. Mass.379.4522
SMILESO=C1NCN(c2ccccc2)C11CCN(CC2COc3ccccc3O2)CC1