Reaction Details
Target5-hydroxytryptamine receptor 1B
LigandBDBM82087
Substrate/Competitorn/a
Ki 1.69±n/a nM
CommentsPDSP_172
Citation Boess, FGMartin, IL Molecular biology of 5-HT receptors. Neuropharmacology33:275-317 (1994) 
 
5-hydroxytryptamine receptor 1B
Name:5-hydroxytryptamine receptor 1B
Type:Protein
Mol. Mass.:43173.33
Organism:Rattus norvegicus (Rat)
Description:P28564
Residue:386
BDBM82087
NameBDBM82087
Synonyms:2-(5-methoxy-1H-indol-3-yl)ethanamine 5-Methoxytryptamine hydrochloride tryptamine, 5-Methoxy
TypeSmall organic molecule
Emp. Form.C11H14N2O
Mol. Mass.190.2417
SMILESCOc1ccc2[nH]cc(CCN)c2c1