Reaction Details
Target5-hydroxytryptamine receptor 1B
LigandBDBM50280055
Substrate/Competitorn/a
Ki 3.71±n/a nM
CommentsPDSP_651
Citation Boess, FGMartin, IL Molecular biology of 5-HT receptors. Neuropharmacology33:275-317 (1994) 
 
5-hydroxytryptamine receptor 1B
Name:5-hydroxytryptamine receptor 1B
Type:Protein
Mol. Mass.:43173.33
Organism:Rattus norvegicus (Rat)
Description:P28564
Residue:386
BDBM50280055
NameBDBM50280055
Synonyms:50285557 DHE
TypeSmall organic molecule
Emp. Form.C33H37N5O5
Mol. Mass.583.6774
SMILESCN1CC(CC2C1Cc1c[nH]c3cccc2c13)C(=O)N[C@]1(C)O[C@@]2(O)C3CCCN3C(=O)[C@H](Cc3ccccc3)N2C1=O