Reaction Details
Target5-hydroxytryptamine receptor 1B
LigandBDBM78940
Substrate/Competitorn/a
Ki 0.19±n/a nM
CommentsPDSP_1219
Citation Boess, FGMartin, IL Molecular biology of 5-HT receptors. Neuropharmacology33:275-317 (1994) 
 
5-hydroxytryptamine receptor 1B
Name:5-hydroxytryptamine receptor 1B
Type:G Protein-Coupled Receptor (GPCR)
Mol. Mass.:43579.17
Organism:Homo sapiens (Human)
Description:Receptor binding assays were performed using human clone stably expressed in CHO cells
Residue:390
BDBM78940
NameBDBM78940
Synonyms:METHIOTHEPIN Methiothepin mesylate salt cid_3039995 methanesulfonic acid;1-methyl-4-(3-methylsulfanyl-5,6-dihydrobenzo[b][1]benzothiepin-5-yl)piperazine | methanesulfonic acid;1-methyl-4-[3-(methylthio)-5,6-dihydrobenzo[b][1]benzothiepin-5-yl]piperazine
TypeSmall organic molecule
Emp. Form.C20H24N2S2
Mol. Mass.356.548
SMILESCSc1ccc2Sc3ccccc3CC(N3CCN(C)CC3)c2c1