Reaction Details
Target5-hydroxytryptamine receptor 1E
LigandBDBM50027065
Substrate/Competitorn/a
Ki 537.03±n/a nM
CommentsPDSP_797
Citation Boess, FGMartin, IL Molecular biology of 5-HT receptors. Neuropharmacology33:275-317 (1994) 
 
5-hydroxytryptamine receptor 1E
Name:5-hydroxytryptamine receptor 1E
Type:G Protein-Coupled Receptor (GPCR)
Mol. Mass.:41697.80
Organism:Homo sapiens (Human)
Description:gi_112822
Residue:365
BDBM50027065
NameBDBM50027065
Synonyms:(5'alpha)-12'-hydroxy-2'-methyl-5'-(phenylmethyl)ergotoman-3',6',18-trione 12'-hydroxy-2'-methyl-5'alpha-(phenylmethyl)ergotaman-3',6',18-trione Ergotamin
TypeSmall organic molecule
Emp. Form.C33H35N5O5
Mol. Mass.581.6615
SMILESCN1C[C@@H](C=C2[C@H]1Cc1c[nH]c3cccc2c13)C(=O)N[C@]1(C)O[C@@]2(O)[C@@H]3CCCN3C(=O)[C@H](Cc3ccccc3)N2C1=O