Reaction Details
Target5-hydroxytryptamine receptor 1F
LigandBDBM30707
Substrate/Competitorn/a
Ki 37.15±n/a nM
CommentsPDSP_694
Citation Boess, FGMartin, IL Molecular biology of 5-HT receptors. Neuropharmacology33:275-317 (1994) 
 
5-hydroxytryptamine receptor 1F
Name:5-hydroxytryptamine receptor 1F
Type:Enzyme Catalytic Domain
Mol. Mass.:41724.68
Organism:Homo sapiens (Human)
Description:5-HT1F HTR1F HUMAN::P30939
Residue:366
BDBM30707
NameBDBM30707
Synonyms:2-(5-methoxy-1H-indol-3-yl)-N,N-dimethyl-ethanamine 2-(5-methoxy-1H-indol-3-yl)ethyl-dimethyl-amine CHEMBL7257 Methoxydimethyltryptamines WO2023019367, Compound 5-MeO-DMT | cid_1832
TypeSmall organic molecule
Emp. Form.C13H18N2O
Mol. Mass.218.2948
SMILESCOc1ccc2[nH]cc(CCN(C)C)c2c1