Reaction Details
Target5-hydroxytryptamine receptor 1F
LigandBDBM81498
Substrate/Competitorn/a
Ki 158.48±n/a nM
CommentsPDSP_1643
Citation Boess, FGMartin, IL Molecular biology of 5-HT receptors. Neuropharmacology33:275-317 (1994) 
 
5-hydroxytryptamine receptor 1F
Name:5-hydroxytryptamine receptor 1F
Type:Enzyme Catalytic Domain
Mol. Mass.:41993.14
Organism:MOUSE
Description:5-HT1F HTR1F MOUSE::Q02284
Residue:366
BDBM81498
NameBDBM81498
Synonyms:5-Methoxy-3-(1,2,3,6-tetrahydro-pyridin-4-yl)-1H-indole(RU-24969) CHEMBL18785 RU 24969
TypeSmall organic molecule
Emp. Form.C14H16N2O
Mol. Mass.228.2896
SMILESCOc1ccc2[nH]cc(C3=CCNCC3)c2c1