Reaction Details
Target5-hydroxytryptamine receptor 2A
LigandBDBM10755
Substrate/Competitorn/a
Ki 1.99±n/a nM
CommentsPDSP_150
Citation Boess, FGMartin, IL Molecular biology of 5-HT receptors. Neuropharmacology33:275-317 (1994) 
 
5-hydroxytryptamine receptor 2A
Name:5-hydroxytryptamine receptor 2A
Type:G Protein-Coupled Receptor (GPCR)
Mol. Mass.:52852.05
Organism:Rattus norvegicus (rat)
Description:Rat cortex membranes 5-HT2A receptors.
Residue:471
BDBM10755
NameBDBM10755
Synonyms:14C-5-hydroxy tryptamine creatinine disulfate 5-HT 5-hydroxy tryptamine creatinine disulfate Serotonin | [3H]-5-HT
TypeSmall organic molecule
Emp. Form.C10H12N2O
Mol. Mass.176.2151
SMILESNCCc1c[nH]c2ccc(O)cc12