Reaction Details
Target5-hydroxytryptamine receptor 3A
LigandBDBM10755
Substrate/Competitorn/a
Ki 269.15±n/a nM
CommentsPDSP_150
Citation Boess, FGMartin, IL Molecular biology of 5-HT receptors. Neuropharmacology33:275-317 (1994) 
 
5-hydroxytryptamine receptor 3A
Name:5-hydroxytryptamine receptor 3A
Type:n/a
Mol. Mass.:56056.00
Organism:Mus musculus (house mouse)
Description:5HT3A
Residue:487
BDBM10755
NameBDBM10755
Synonyms:14C-5-hydroxy tryptamine creatinine disulfate 5-HT 5-hydroxy tryptamine creatinine disulfate Serotonin | [3H]-5-HT
TypeSmall organic molecule
Emp. Form.C10H12N2O
Mol. Mass.176.2151
SMILESNCCc1c[nH]c2ccc(O)cc12