Reaction Details
Target5-hydroxytryptamine receptor 3A
LigandBDBM50007871
Substrate/Competitorn/a
Ki 1.99±n/a nM
CommentsPDSP_1919
Citation Boess, FGMartin, IL Molecular biology of 5-HT receptors. Neuropharmacology33:275-317 (1994) 
 
5-hydroxytryptamine receptor 3A
Name:5-hydroxytryptamine receptor 3A
Type:n/a
Mol. Mass.:56056.00
Organism:Mus musculus (house mouse)
Description:5HT3A
Residue:487
BDBM50007871
NameBDBM50007871
Synonyms:CHEMBL8197 TROPISETRON
TypeSmall organic molecule
Emp. Form.C17H20N2O2
Mol. Mass.284.3529
SMILESCN1C2CCC1CC(C2)OC(=O)c1c[nH]c2ccccc12