Reaction Details
Target5-hydroxytryptamine receptor 4
LigandBDBM50007872
Substrate/Competitorn/a
Ki 15.84±n/a nM
CommentsPDSP_399
Citation Boess, FGMartin, IL Molecular biology of 5-HT receptors. Neuropharmacology33:275-317 (1994) 
 
5-hydroxytryptamine receptor 4
Name:5-hydroxytryptamine receptor 4
Type:Enzyme Catalytic Domain
Mol. Mass.:43735.29
Organism:GUINEA PIG
Description:5-HT4 HTR4 GUINEA PIG::O70528
Residue:388
BDBM50007872
NameBDBM50007872
Synonyms:3-Ethyl-2-oxo-2,3-dihydro-benzoimidazole-1-carboxylic acid (8-methyl-8-aza-bicyclo[3.2.1]oct-3-yl)-amide; hydrochloride CHEMBL544755 | CHEMBL62023
TypeSmall organic molecule
Emp. Form.C18H24N4O2
Mol. Mass.328.4088
SMILESCCn1c2ccccc2n(C(=O)NC2CC3CCC(C2)N3C)c1=O