Reaction Details
Target5-hydroxytryptamine receptor 4
LigandBDBM50005836
Substrate/Competitorn/a
Ki 63.09±n/a nM
CommentsPDSP_530
Citation Boess, FGMartin, IL Molecular biology of 5-HT receptors. Neuropharmacology33:275-317 (1994) 
 
5-hydroxytryptamine receptor 4
Name:5-hydroxytryptamine receptor 4
Type:Enzyme Catalytic Domain
Mol. Mass.:43735.29
Organism:GUINEA PIG
Description:5-HT4 HTR4 GUINEA PIG::O70528
Residue:388
BDBM50005836
NameBDBM50005836
Synonyms:4-Amino-5-chloro-N-{1-[3-(4-fluoro-phenoxy)-propyl]-3-methoxy-piperidin-4-yl}-2-methoxy-benzamide CHEMBL560739 PROPULSID US10800776, Example Cisapride cid_5311047
TypeSmall organic molecule
Emp. Form.C23H29ClFN3O4
Mol. Mass.465.945
SMILESCOC1CN(CCCOc2ccc(F)cc2)CCC1NC(=O)c1cc(Cl)c(N)cc1OC