Reaction Details
Target5-hydroxytryptamine receptor 5B
LigandBDBM21342
Substrate/Competitorn/a
Ki 3.23±n/a nM
CommentsPDSP_1091
Citation Boess, FGMartin, IL Molecular biology of 5-HT receptors. Neuropharmacology33:275-317 (1994) 
 
5-hydroxytryptamine receptor 5B
Name:5-hydroxytryptamine receptor 5B
Type:Enzyme Catalytic Domain
Mol. Mass.:41141.95
Organism:RAT
Description:5-HT5B 0 RAT::P35365
Residue:370
BDBM21342
NameBDBM21342
Synonyms:(4R,7R)-N,N-diethyl-6-methyl-6,11-diazatetracyclo[7.6.1.0^{2,7}.0^{12,16}]hexadeca-1(16),2,9,12,14-pentaene-4-carboxamide LSD LSD,(+) Lysergic Acid Diethylamide [3H]-LSD | d-Isolysergic acid amide
Typeradiolabeled ligand
Emp. Form.C20H25N3O
Mol. Mass.323.432
SMILES[H][C@@]12Cc3c[nH]c4cccc(C1=C[C@H](CN2C)C(=O)N(CC)CC)c34