Reaction Details
Target5-hydroxytryptamine receptor 7
LigandBDBM50008735
Substrate/Competitorn/a
Ki 31.62±n/a nM
CommentsPDSP_449
Citation Boess, FGMartin, IL Molecular biology of 5-HT receptors. Neuropharmacology33:275-317 (1994) 
 
5-hydroxytryptamine receptor 7
Name:5-hydroxytryptamine receptor 7
Type:Enzyme
Mol. Mass.:49932.71
Organism:Mus musculus (Mouse)
Description:P32304
Residue:448
BDBM50008735
NameBDBM50008735
Synonyms:(+)-3-(tert-butyl)-(3S,4aS,13bS)-2,3,4,4a,8,9,13b,14-octahydro-1H-benzo[4,5]cyclohepta[de]pyrido[2,1-a]isoquinolin-3-ol (+/-)-3-(tert-butyl)-(3S,4aS,13bS)-2,3,4,4a,8,9,13b,14-octahydro-1H-benzo[4,5]cyclohepta[de]pyrido[2,1-a]isoquinolin-3-ol 3-(tert-butyl)-(3S,4aS,13bS)-2,3,4,4a,8,9,13b,14-octahydro-1H-benzo[4,5]cyclohepta[de]pyrido[2,1-a]isoquinolin-3-ol 3-(tert-butyl)-(3S,4aS,13bS)-2,3,4,4a,8,9,13b,14-octahydro-1H-benzo[4,5]cyclohepta[de]pyrido[2,1-a]isoquinolin-3-ol((+)-butaclamol) BUTACLAMOL BUTACLAMOL,(+) CHEMBL8514 | d-Butaclamol
TypeSmall organic molecule
Emp. Form.C25H31NO
Mol. Mass.361.5197
SMILESCC(C)(C)[C@]1(O)CCN2C[C@H]3c4ccccc4CCc4cccc([C@@H]2C1)c34