Reaction Details
Target5-hydroxytryptamine receptor 7
LigandBDBM50130269
Substrate/Competitorn/a
Ki 10±n/a nM
CommentsPDSP_1095
Citation Boess, FGMartin, IL Molecular biology of 5-HT receptors. Neuropharmacology33:275-317 (1994) 
 
5-hydroxytryptamine receptor 7
Name:5-hydroxytryptamine receptor 7
Type:Enzyme
Mol. Mass.:49932.71
Organism:Mus musculus (Mouse)
Description:P32304
Residue:448
BDBM50130269
NameBDBM50130269
Synonyms:(6aR,9R)-5-Bromo-7-methyl-4,6,6a,7,8,9-hexahydro-indolo[4,3-fg]quinoline-9-carboxylic acid diethylamide CHEMBL274384 | LSD,2-Bromo
TypeSmall organic molecule
Emp. Form.C20H24BrN3O
Mol. Mass.402.328
SMILESCCN(CC)C(=O)[C@H]1CN(C)[C@@H]2Cc3c(Br)[nH]c4cccc(C2=C1)c34