Reaction Details
Target5-hydroxytryptamine receptor 7
LigandBDBM35256
Substrate/Competitorn/a
Ki 100±n/a nM
CommentsPDSP_1235
Citation Boess, FGMartin, IL Molecular biology of 5-HT receptors. Neuropharmacology33:275-317 (1994) 
 
5-hydroxytryptamine receptor 7
Name:5-hydroxytryptamine receptor 7
Type:Enzyme
Mol. Mass.:49932.71
Organism:Mus musculus (Mouse)
Description:P32304
Residue:448
BDBM35256
NameBDBM35256
Synonyms:(S)-mianserin MIANSERIN MIANSERIN (-) | Tolvon
TypeSmall organic molecule
Emp. Form.C18H20N2
Mol. Mass.264.3648
SMILES[H][C@]12CN(C)CCN1c1ccccc1Cc1ccccc21