Reaction Details
TargetAlpha-2C adrenergic receptor
LigandBDBM50019492
Substrate/Competitorn/a
Ki 1.78±n/a nM
CommentsPDSP_1648
Citation Uhlén, SPorter, ACNeubig, RR The novel alpha-2 adrenergic radioligand [3H]-MK912 is alpha-2C selective among human alpha-2A, alpha-2B and alpha-2C adrenoceptors. J Pharmacol Exp Ther271:1558-65 (1994) Alpha-2C adrenergic receptor
Name:Alpha-2C adrenergic receptor
Type:Enzyme
Mol. Mass.:49552.32
Organism:Homo sapiens (Human)
Description:P18825
Residue:462
BDBM50019492
NameBDBM50019492
Synonyms:(+)2-(2-Methoxy-2,3-dihydro-benzo[1,4]dioxin-2-yl)-4,5-dihydro-1H-imidazole 2-(2,3-dihydro-2-methoxy-1,4-benzodioxin-2-yl)-4,5-dihydro-1H-imidazole 2-(2-methoxy-2,3-dihydrobenzo[b][1,4]dioxin-2-yl)-4,5-dihydro-1H-imidazole CHEMBL10332 RX821002
TypeSmall organic molecule
Emp. Form.C12H14N2O3
Mol. Mass.234.2512
SMILESCOC1(COc2ccccc2O1)C1=NCCN1