Reaction Details
TargetD(1A) dopamine receptor
LigandBDBM29525
Substrate/Competitorn/a
Ki>10000±n/a nM
CommentsPDSP_880
Citation Gale, JDGrossman, CJWhitehead, JWOxford, AWBunce, KTHumphrey, PP GR113808: a novel, selective antagonist with high affinity at the 5-HT4 receptor. Br J Pharmacol111:332-8 (1994) 
 
D(1A) dopamine receptor
Name:D(1A) dopamine receptor
Type:Enzyme Catalytic Domain
Mol. Mass.:49429.75
Organism:RAT
Description:P18901
Residue:446
BDBM29525
NameBDBM29525
Synonyms:3H-GR113808 GR 113808 [3H]GR113808
Typeradiolabeled ligand
Emp. Form.C19H27N3O4S
Mol. Mass.393.5
SMILESCn1cc(C(=O)OCC2CCN(CCNS(C)(=O)=O)CC2)c2ccccc12