Reaction Details
TargetAdenosine receptor A1
LigandBDBM82540
Substrate/Competitorn/a
Ki>10000±n/a nM
CommentsPDSP_2563
Citation van Galen, PJvan Bergen, AHGallo-Rodriguez, CMelman, NOlah, MEIJzerman, APStiles, GLJacobson, KA A binding site model and structure-activity relationships for the rat A3 adenosine receptor. Mol Pharmacol45:1101-11 (1994) Adenosine receptor A1
Name:Adenosine receptor A1
Type:Protein
Mol. Mass.:36704.13
Organism:Rattus norvegicus (rat)
Description:n/a
Residue:326
BDBM82540
NameBDBM82540
Synonyms:CAS_146-80-5 Xanthosine
TypeSmall organic molecule
Emp. Form.C10H13N4O9P
Mol. Mass.364.2054
SMILESOC1C(COP(O)(O)=O)OC(C1O)n1cnc2c1[nH]c(=O)[nH]c2=O