Reaction Details
TargetAdenosine receptor A2a
LigandBDBM82521
Substrate/Competitorn/a
Ki>10000±n/a nM
CommentsPDSP_2577
Citation van Galen, PJvan Bergen, AHGallo-Rodriguez, CMelman, NOlah, MEIJzerman, APStiles, GLJacobson, KA A binding site model and structure-activity relationships for the rat A3 adenosine receptor. Mol Pharmacol45:1101-11 (1994) Adenosine receptor A2a
Name:Adenosine receptor A2a
Type:G Protein-Coupled Receptor (GPCR)
Mol. Mass.:45015.65
Organism:Rattus norvegicus (rat)
Description:Rat A2A receptors expressed in CHO cells.
Residue:410
BDBM82521
NameBDBM82521
Synonyms:3,9-DimethylX 3,9-dimethyl-3,9-dihydro-1h-purine-2,6-dione
TypeSmall organic molecule
Emp. Form.C7H8N4O2
Mol. Mass.180.164
SMILESCn1cnc2c1n(C)c(=O)[nH]c2=O