Reaction Details
TargetTransmembrane and immunoglobulin domain-containing 3
LigandBDBM82528
Substrate/Competitorn/a
Ki 6.8±n/a nM
CommentsPDSP_2589
Citation van Galen, PJvan Bergen, AHGallo-Rodriguez, CMelman, NOlah, MEIJzerman, APStiles, GLJacobson, KA A binding site model and structure-activity relationships for the rat A3 adenosine receptor. Mol Pharmacol45:1101-11 (1994) Transmembrane and immunoglobulin domain-containing 3
Name:Transmembrane and immunoglobulin domain-containing 3
Type:Enzyme Catalytic Domain
Mol. Mass.:25707.75
Organism:RAT
Description:Q4V8H0
Residue:232
BDBM82528
NameBDBM82528
Synonyms:N6-BenzylNECA
TypeSmall organic molecule
Emp. Form.C20H24N6O5
Mol. Mass.428.4418
SMILESCCNC(=O)OC[C@H]1OC([C@H](O)[C@@H]1O)n1cnc2c(NCc3ccccc3)ncnc12