Reaction Details
TargetTransmembrane and immunoglobulin domain-containing 3
LigandBDBM82537
Substrate/Competitorn/a
Ki 468±n/a nM
CommentsPDSP_2593
Citation van Galen, PJvan Bergen, AHGallo-Rodriguez, CMelman, NOlah, MEIJzerman, APStiles, GLJacobson, KA A binding site model and structure-activity relationships for the rat A3 adenosine receptor. Mol Pharmacol45:1101-11 (1994) Transmembrane and immunoglobulin domain-containing 3
Name:Transmembrane and immunoglobulin domain-containing 3
Type:Enzyme Catalytic Domain
Mol. Mass.:25707.75
Organism:RAT
Description:Q4V8H0
Residue:232
BDBM82537
NameBDBM82537
Synonyms:NECA-N1-oxide
TypeSmall organic molecule
Emp. Form.C13H20N6O6
Mol. Mass.356.3345
SMILESCCNC(=O)OC[C@H]1OC([C@H](O)[C@@H]1O)n1cnc2C(N)N(O)C=Nc12