Reaction Details
TargetMuscarinic acetylcholine receptor M1
LigandBDBM50079527
Substrate/Competitorn/a
Ki 38±n/a nM
CommentsPDSP_735
Citation Stanton, TBolden-Watson, CCusack, BRichelson, E Antagonism of the five cloned human muscarinic cholinergic receptors expressed in CHO-K1 cells by antidepressants and antihistaminics. Biochem Pharmacol45:2352-4 (1993) 
 
Muscarinic acetylcholine receptor M1
Name:Muscarinic acetylcholine receptor M1
Type:Protein
Mol. Mass.:51442.54
Organism:Homo sapiens (Human)
Description:P11229
Residue:460
BDBM50079527
NameBDBM50079527
Synonyms:(3E)-3-dibenzo[b,e]oxepin-11(6H)-ylidene-N,N-dimethylpropan-1-amine(3Z)-3-dibenzo[b,e]oxepin-11(6H)-ylidene-N,N-dimethylpropan-1-amine DOXEPIN | cis-doxepin
TypeSmall organic molecule
Emp. Form.C19H21NO
Mol. Mass.279.3761
SMILESCN(C)CC\C=C1\c2ccccc2COc2ccccc12