Reaction Details
TargetMuscarinic acetylcholine receptor M3
LigandBDBM50062614
Substrate/Competitorn/a
Ki 120±n/a nM
CommentsPDSP_3903
Citation Stanton, TBolden-Watson, CCusack, BRichelson, E Antagonism of the five cloned human muscarinic cholinergic receptors expressed in CHO-K1 cells by antidepressants and antihistaminics. Biochem Pharmacol45:2352-4 (1993) 
 
Muscarinic acetylcholine receptor M3
Name:Muscarinic acetylcholine receptor M3
Type:Enzyme
Mol. Mass.:66151.03
Organism:Homo sapiens (Human)
Description:P20309
Residue:590
BDBM50062614
NameBDBM50062614
Synonyms:CHEMBL900 Disipal N,N-dimethyl-2-(phenyl(o-tolyl)methoxy)ethanamine Norgesic Orphengesic
TypeSmall organic molecule
Emp. Form.C18H23NO
Mol. Mass.269.3813
SMILESCN(C)CCOC(c1ccccc1)c1ccccc1C