Reaction Details
TargetMuscarinic acetylcholine receptor M3
LigandBDBM81768
Substrate/Competitorn/a
Ki 0.08±n/a nM
CommentsPDSP_2042
Citation Stanton, TBolden-Watson, CCusack, BRichelson, E Antagonism of the five cloned human muscarinic cholinergic receptors expressed in CHO-K1 cells by antidepressants and antihistaminics. Biochem Pharmacol45:2352-4 (1993) 
 
Muscarinic acetylcholine receptor M3
Name:Muscarinic acetylcholine receptor M3
Type:Enzyme
Mol. Mass.:66151.03
Organism:Homo sapiens (Human)
Description:P20309
Residue:590
BDBM81768
NameBDBM81768
Synonyms:BENZYLIC ACID NSC_5311391 | Quinuclidinyl benzilate
TypeSmall organic molecule
Emp. Form.C14H12O3
Mol. Mass.228.2433
SMILESOC(=O)C(O)(c1ccccc1)c1ccccc1