Reaction Details
TargetMuscarinic acetylcholine receptor M4
LigandBDBM28347
Substrate/Competitorn/a
Ki 11.1±n/a nM
CommentsPDSP_1203
Citation Stanton, TBolden-Watson, CCusack, BRichelson, E Antagonism of the five cloned human muscarinic cholinergic receptors expressed in CHO-K1 cells by antidepressants and antihistaminics. Biochem Pharmacol45:2352-4 (1993) 
 
Muscarinic acetylcholine receptor M4
Name:Muscarinic acetylcholine receptor M4
Type:Enzyme Catalytic Domain
Mol. Mass.:53079.31
Organism:Homo sapiens (Human)
Description:Cholinergic, muscarinic M4 CHRM4 HUMAN M3::P08173
Residue:479
BDBM28347
NameBDBM28347
Synonyms:3-(10H-phenothiazin-10-ylmethyl)-1-azabicyclo[2.2.2]octan-1-ium ZINC01567421, 6
TypeSmall organic molecule
Emp. Form.C20H23N2S
Mol. Mass.323.474
SMILESC(C1C[NH+]2CCC1CC2)N1c2ccccc2Sc2ccccc12