Reaction Details
TargetD(2) dopamine receptor
LigandBDBM81792
Substrate/Competitorn/a
Ki 29.4±n/a nM
CommentsPDSP_1942
Citation Lahti, RAEvans, DLStratman, NCFigur, LM Dopamine D4 versus D2 receptor selectivity of dopamine receptor antagonists: possible therapeutic implications. Eur J Pharmacol236:483-6 (1993) 
 
D(2) dopamine receptor
Name:D(2) dopamine receptor
Type:Cell-surface receptors
Mol. Mass.:50647.10
Organism:Homo sapiens (Human)
Description:P14416
Residue:443
BDBM81792
NameBDBM81792
Synonyms:CAS_5311190 UH232 | UH232(+)
TypeSmall organic molecule
Emp. Form.C18H27NO
Mol. Mass.273.4131
SMILESCCCN(CCC)C1C=Cc2c(OC)cccc2C1C