Reaction Details
TargetDelta-type opioid receptor
LigandBDBM82554
Substrate/Competitorn/a
Ki 115±n/a nM
CommentsPDSP_349
Citation Raynor, KKong, HChen, YYasuda, KYu, LBell, GIReisine, T Pharmacological characterization of the cloned kappa-, delta-, and mu-opioid receptors. Mol Pharmacol45:330-4 (1994) 
 
Delta-type opioid receptor
Name:Delta-type opioid receptor
Type:G Protein-Coupled Receptor (GPCR)
Mol. Mass.:40382.98
Organism:Homo sapiens (Human)
Description:Competition binding assays were carried out using membrane preparations from transfected HN9.10 cells that constitutively expressed the delta opioid receptor.
Residue:372
BDBM82554
NameBDBM82554
Synonyms:Beta C N A NSC_115070
TypeSmall organic molecule
Emp. Form.C24H32Cl2N2O3
Mol. Mass.467.428
SMILESOc1ccc2CC3N(CC4CC4)CCC45C(Oc1c24)C(CCC35O)N(CCCl)CCCl