Reaction Details
TargetDelta-type opioid receptor
LigandBDBM50040485
Substrate/Competitorn/a
Ki 0.66±n/a nM
CommentsPDSP_407
Citation Raynor, KKong, HChen, YYasuda, KYu, LBell, GIReisine, T Pharmacological characterization of the cloned kappa-, delta-, and mu-opioid receptors. Mol Pharmacol45:330-4 (1994) 
 
Delta-type opioid receptor
Name:Delta-type opioid receptor
Type:G Protein-Coupled Receptor (GPCR)
Mol. Mass.:40382.98
Organism:Homo sapiens (Human)
Description:Competition binding assays were carried out using membrane preparations from transfected HN9.10 cells that constitutively expressed the delta opioid receptor.
Residue:372
BDBM50040485
NameBDBM50040485
Synonyms:15-benzyl-4-cyclopropylmethyl-10,17-dihydroxy-(1S,13R,15R,17S)-12-oxa-4-azapentacyclo[9.6.1.01,13.05,17.07,18]octadeca-7,9,11(18)-trien-14-one | BNTX
TypeSmall organic molecule
Emp. Form.C27H27NO4
Mol. Mass.429.5076
SMILESOc1ccc2CC3N(CC4CC4)CC[C@@]45[C@@H](Oc1c24)C(=O)C(C[C@@]35O)=Cc1ccccc1