Reaction Details
TargetKappa-type opioid receptor
LigandBDBM50045216
Substrate/Competitorn/a
Ki 1000±n/a nM
CommentsPDSP_1713
Citation Raynor, KKong, HChen, YYasuda, KYu, LBell, GIReisine, T Pharmacological characterization of the cloned kappa-, delta-, and mu-opioid receptors. Mol Pharmacol45:330-4 (1994) 
 
Kappa-type opioid receptor
Name:Kappa-type opioid receptor
Type:G Protein-Coupled Receptor (GPCR)
Mol. Mass.:42648.76
Organism:Homo sapiens (Human)
Description:P41145
Residue:380
BDBM50045216
NameBDBM50045216
Synonyms:7-(Spiroindano)Oxymorphone SIOM
TypeSmall organic molecule
Emp. Form.C25H25NO4
Mol. Mass.403.4703
SMILESCN1CC[C@@]23[C@H]4Oc5c2c(CC1[C@]3(O)CC1(Cc2ccccc2C1)C4=O)ccc5O