Reaction Details
TargetKappa-type opioid receptor
LigandBDBM94503
Substrate/Competitorn/a
Ki 75±n/a nM
CommentsPDSP_1778
Citation Raynor, KKong, HChen, YYasuda, KYu, LBell, GIReisine, T Pharmacological characterization of the cloned kappa-, delta-, and mu-opioid receptors. Mol Pharmacol45:330-4 (1994) 
 
Kappa-type opioid receptor
Name:Kappa-type opioid receptor
Type:G Protein-Coupled Receptor (GPCR)
Mol. Mass.:42648.76
Organism:Homo sapiens (Human)
Description:P41145
Residue:380
BDBM94503
NameBDBM94503
Synonyms:2-hydroxypropane-1,2,3-tricarboxylic acid;N-[4-(methoxymethyl)-1-(2-thiophen-2-ylethyl)-4-piperidinyl]-N-phenylpropanamide MLS002320668 SMR001338814 Sufentanil citrate cid_65494 | citric acid;N-[4-(methoxymethyl)-1-[2-(2-thienyl)ethyl]-4-piperidyl]-N-phenyl-propionamide
TypeSmall organic molecule
Emp. Form.C22H30N2O2S
Mol. Mass.386.551
SMILESCCC(=O)N(c1ccccc1)C1(COC)CCN(CCc2cccs2)CC1