Reaction Details
TargetMu-type opioid receptor
LigandBDBM82554
Substrate/Competitorn/a
Ki 0.9±n/a nM
CommentsPDSP_349
Citation Raynor, KKong, HChen, YYasuda, KYu, LBell, GIReisine, T Pharmacological characterization of the cloned kappa-, delta-, and mu-opioid receptors. Mol Pharmacol45:330-4 (1994) 
 
Mu-type opioid receptor
Name:Mu-type opioid receptor
Type:G Protein-Coupled Receptor (GPCR)
Mol. Mass.:44789.51
Organism:Homo sapiens (Human)
Description:P35372
Residue:400
BDBM82554
NameBDBM82554
Synonyms:Beta C N A NSC_115070
TypeSmall organic molecule
Emp. Form.C24H32Cl2N2O3
Mol. Mass.467.428
SMILESOc1ccc2CC3N(CC4CC4)CCC45C(Oc1c24)C(CCC35O)N(CCCl)CCCl