Reaction Details
Target5-hydroxytryptamine receptor 6
LigandBDBM50014406
Substrate/Competitorn/a
Ki 398.1±n/a nM
CommentsPDSP_154
Citation Unsworth, CDMolinoff, PB Characterization of a 5-hydroxytryptamine receptor in mouse neuroblastoma N18TG2 cells. J Pharmacol Exp Ther269:246-55 (1994) 
 
5-hydroxytryptamine receptor 6
Name:5-hydroxytryptamine receptor 6
Type:Enzyme Catalytic Domain
Mol. Mass.:47012.98
Organism:MOUSE
Description:5-HT6 HTR6 MOUSE::Q9R1C8
Residue:440
BDBM50014406
NameBDBM50014406
Synonyms:2-Me 5-HT 2-methyl-5-HT 3-(2-aminoethyl)-2-methyl-1H-indol-5-ol CHEMBL266591
TypeSmall organic molecule
Emp. Form.C11H14N2O
Mol. Mass.190.2417
SMILESCc1[nH]c2ccc(O)cc2c1CCN