Reaction Details
TargetTransmembrane and immunoglobulin domain-containing 3
LigandBDBM50021484
Substrate/Competitorn/a
Ki 33.1±n/a nM
CommentsPDSP_2898
Citation Olah, MEGallo-Rodriguez, CJacobson, KAStiles, GL 125I-4-aminobenzyl-5'-N-methylcarboxamidoadenosine, a high affinity radioligand for the rat A3 adenosine receptor. Mol Pharmacol45:978-82 (1994) Transmembrane and immunoglobulin domain-containing 3
Name:Transmembrane and immunoglobulin domain-containing 3
Type:Enzyme Catalytic Domain
Mol. Mass.:25707.75
Organism:RAT
Description:Q4V8H0
Residue:232
BDBM50021484
NameBDBM50021484
Synonyms:5-(6-Cyclohexylamino-purin-9-yl)-3,4-dihydroxy-tetrahydro-furan-2-carboxylic acid ethylamide N6-CyclohexylNECA
TypeSmall organic molecule
Emp. Form.C18H26N6O4
Mol. Mass.390.4368
SMILESCCNC(=O)C1OC(C(O)C1O)n1cnc2c(NC3CCCCC3)ncnc12