Reaction Details
TargetTransmembrane and immunoglobulin domain-containing 3
LigandBDBM21220
Substrate/Competitorn/a
Ki 260.5±n/a nM
CommentsPDSP_1302
Citation Olah, MEGallo-Rodriguez, CJacobson, KAStiles, GL 125I-4-aminobenzyl-5'-N-methylcarboxamidoadenosine, a high affinity radioligand for the rat A3 adenosine receptor. Mol Pharmacol45:978-82 (1994) Transmembrane and immunoglobulin domain-containing 3
Name:Transmembrane and immunoglobulin domain-containing 3
Type:Enzyme Catalytic Domain
Mol. Mass.:25707.75
Organism:RAT
Description:Q4V8H0
Residue:232
BDBM21220
NameBDBM21220
Synonyms:(2S,3S,4R,5R)-5-(6-amino-9H-purin-9-yl)-N-ethyl-3,4-dihydroxyoxolane-2-carboxamide Adenosine, N6-Ethyl-carboxamido CHEMBL464859 NECA
TypeAntineoplastic Agent
Emp. Form.C12H16N6O4
Mol. Mass.308.2932
SMILESCCNC(=O)[C@H]1O[C@H]([C@H](O)[C@@H]1O)n1cnc2c(N)ncnc12