Reaction Details
TargetTransmembrane and immunoglobulin domain-containing 3
LigandBDBM50006730
Substrate/Competitorn/a
Ki 217.9±n/a nM
CommentsPDSP_1618
Citation Olah, MEGallo-Rodriguez, CJacobson, KAStiles, GL 125I-4-aminobenzyl-5'-N-methylcarboxamidoadenosine, a high affinity radioligand for the rat A3 adenosine receptor. Mol Pharmacol45:978-82 (1994) Transmembrane and immunoglobulin domain-containing 3
Name:Transmembrane and immunoglobulin domain-containing 3
Type:Enzyme Catalytic Domain
Mol. Mass.:25707.75
Organism:RAT
Description:Q4V8H0
Residue:232
BDBM50006730
NameBDBM50006730
Synonyms:(R)-2-Hydroxymethyl-5-[6-(1-methyl-2-phenyl-ethylamino)-purin-9-yl]-tetrahydro-furan-3,4-diol (S)-2-Hydroxymethyl-5-[6-(1-methyl-2-phenyl-ethylamino)-purin-9-yl]-tetrahydro-furan-3,4-diol 2-Hydroxymethyl-5-[6-(1-methyl-2-phenyl-ethylamino)-purin-9-yl]-tetrahydro-furan-3,4-diol ChEMBL_20163 L-2-Hydroxymethyl-5-[6-(1-methyl-2-phenyl-ethylamino)-purin-9-yl]-tetrahydro-furan-3,4-diol R-PIA | S-PIA
TypeSmall organic molecule
Emp. Form.C19H23N5O4
Mol. Mass.385.417
SMILESCC(Cc1ccccc1)Nc1ncnc2n(cnc12)C1OC(CO)C(O)C1O