Reaction Details
Target5-hydroxytryptamine receptor 5B
LigandBDBM35234
Substrate/Competitorn/a
Ki 1000±n/a nM
CommentsPDSP_1348
Citation Wisden, WParker, EMMahle, CDGrisel, DANowak, HPYocca, FDFelder, CCSeeburg, PHVoigt, MM Cloning and characterization of the rat 5-HT5B receptor. Evidence that the 5-HT5B receptor couples to a G protein in mammalian cell membranes. FEBS Lett333:25-31 (1993) 
 
5-hydroxytryptamine receptor 5B
Name:5-hydroxytryptamine receptor 5B
Type:Enzyme Catalytic Domain
Mol. Mass.:41141.95
Organism:RAT
Description:5-HT5B 0 RAT::P35365
Residue:370
BDBM35234
NameBDBM35234
Synonyms:DL-[7-3H]norepinephrine Noradrenaline,(+) | [3H]NE
Typeradiolabeled ligand
Emp. Form.C8H11NO3
Mol. Mass.169.1778
SMILESNCC(O)c1ccc(O)c(O)c1