Reaction Details
Target5-hydroxytryptamine receptor 5B
LigandBDBM50000492
Substrate/Competitorn/a
Ki 1000±n/a nM
CommentsPDSP_1990
Citation Wisden, WParker, EMMahle, CDGrisel, DANowak, HPYocca, FDFelder, CCSeeburg, PHVoigt, MM Cloning and characterization of the rat 5-HT5B receptor. Evidence that the 5-HT5B receptor couples to a G protein in mammalian cell membranes. FEBS Lett333:25-31 (1993) 
 
5-hydroxytryptamine receptor 5B
Name:5-hydroxytryptamine receptor 5B
Type:Enzyme Catalytic Domain
Mol. Mass.:41141.95
Organism:RAT
Description:5-HT5B 0 RAT::P35365
Residue:370
BDBM50000492
NameBDBM50000492
Synonyms:(zacopride)4-Amino-N-(1-aza-bicyclo[2.2.2]oct-3-yl)-5-chloro-2-methoxy-benzamide 4-Amino-N-(1-aza-bicyclo[2.2.2]oct-3-yl)-5-chloro-2-methoxy-benzamide (Zacopride) CHEMBL18041 ZACOPRIDE ZACOPRIDE,RS | ZACOPRIDE,S
TypeSmall organic molecule
Emp. Form.C15H20ClN3O2
Mol. Mass.309.791
SMILESCOc1cc(N)c(Cl)cc1C(=O)NC1CN2CCC1CC2