Reaction Details
Target5-hydroxytryptamine receptor 3A
LigandBDBM94507
Substrate/Competitorn/a
Ki 165±n/a nM
CommentsPDSP_471
Citation Bonhaus, DWLoury, DNJakeman, LBTo, ZDeSouza, AEglen, RMWong, EH [3H]BIMU-1, a 5-hydroxytryptamine3 receptor ligand in NG-108 cells, selectively labels sigma-2 binding sites in guinea pig hippocampus. J Pharmacol Exp Ther267:961-70 (1993) 5-hydroxytryptamine receptor 3A
Name:5-hydroxytryptamine receptor 3A
Type:Enzyme Catalytic Domain
Mol. Mass.:55657.07
Organism:GUINEA PIG
Description:5-HT3 HTR3A GUINEA PIG::O70212
Residue:490
BDBM94507
NameBDBM94507
Synonyms:2-[2-(diethylamino)ethoxy]ethyl 1-phenylcyclopentane-1-carboxylate;2-hydroxypropane-1,2,3-tricarboxylic acid 2-hydroxypropane-1,2,3-tricarboxylic acid;1-phenyl-1-cyclopentanecarboxylic acid 2-[2-(diethylamino)ethoxy]ethyl ester CHEMBL73234 MLS002222257 cid_90010 | citric acid;1-phenylcyclopentanecarboxylic acid 2-[2-(diethylamino)ethoxy]ethyl ester
TypeSmall organic molecule
Emp. Form.C20H31NO3
Mol. Mass.333.465
SMILESCCN(CC)CCOCCOC(=O)C1(CCCC1)c1ccccc1