Reaction Details
Target5-hydroxytryptamine receptor 3A
LigandBDBM50007892
Substrate/Competitorn/a
Ki 6310±n/a nM
CommentsPDSP_621
Citation Bonhaus, DWLoury, DNJakeman, LBTo, ZDeSouza, AEglen, RMWong, EH [3H]BIMU-1, a 5-hydroxytryptamine3 receptor ligand in NG-108 cells, selectively labels sigma-2 binding sites in guinea pig hippocampus. J Pharmacol Exp Ther267:961-70 (1993) 5-hydroxytryptamine receptor 3A
Name:5-hydroxytryptamine receptor 3A
Type:Enzyme Catalytic Domain
Mol. Mass.:55657.07
Organism:GUINEA PIG
Description:5-HT3 HTR3A GUINEA PIG::O70212
Residue:490
BDBM50007892
NameBDBM50007892
Synonyms:2-Oxo-2,3-dihydro-benzoimidazole-1-carboxylic acid (8-methyl-8-aza-bicyclo[3.2.1]oct-3-yl)-amide; hydrochloride DAU 6215
TypeSmall organic molecule
Emp. Form.C16H20N4O2
Mol. Mass.300.3556
SMILESCN1C2CCC1CC(C2)NC(=O)n1c2ccccc2[nH]c1=O