Reaction Details
Target5-hydroxytryptamine receptor 3A
LigandBDBM50007871
Substrate/Competitorn/a
Ki>10000±n/a nM
CommentsPDSP_956
Citation Bonhaus, DWLoury, DNJakeman, LBTo, ZDeSouza, AEglen, RMWong, EH [3H]BIMU-1, a 5-hydroxytryptamine3 receptor ligand in NG-108 cells, selectively labels sigma-2 binding sites in guinea pig hippocampus. J Pharmacol Exp Ther267:961-70 (1993) 5-hydroxytryptamine receptor 3A
Name:5-hydroxytryptamine receptor 3A
Type:Enzyme Catalytic Domain
Mol. Mass.:55657.07
Organism:GUINEA PIG
Description:5-HT3 HTR3A GUINEA PIG::O70212
Residue:490
BDBM50007871
NameBDBM50007871
Synonyms:CHEMBL8197 TROPISETRON
TypeSmall organic molecule
Emp. Form.C17H20N2O2
Mol. Mass.284.3529
SMILESCN1C2CCC1CC(C2)OC(=O)c1c[nH]c2ccccc12