Reaction Details
Target5-hydroxytryptamine receptor 3A
LigandBDBM81924
Substrate/Competitorn/a
Ki 2.5±n/a nM
CommentsPDSP_1522
Citation Bonhaus, DWLoury, DNJakeman, LBTo, ZDeSouza, AEglen, RMWong, EH [3H]BIMU-1, a 5-hydroxytryptamine3 receptor ligand in NG-108 cells, selectively labels sigma-2 binding sites in guinea pig hippocampus. J Pharmacol Exp Ther267:961-70 (1993) 5-hydroxytryptamine receptor 3A
Name:5-hydroxytryptamine receptor 3A
Type:Enzyme Catalytic Domain
Mol. Mass.:55657.07
Organism:GUINEA PIG
Description:5-HT3 HTR3A GUINEA PIG::O70212
Residue:490
BDBM81924
NameBDBM81924
Synonyms:(R)-3-(1-Propyl-piperidin-3-yl)-phenol CAS_85976-54-1 NSC_202477 PPP, S(-)-3
TypeSmall organic molecule
Emp. Form.C14H21NO
Mol. Mass.219.3226
SMILESCCCN1CCCC(C1)c1cccc(O)c1