Reaction Details
TargetMuscarinic acetylcholine receptor M2
LigandBDBM81900
Substrate/Competitorn/a
Ki 5.01±n/a nM
CommentsPDSP_71
Citation Melchiorre, CBolognesi, MLChiarini, AMinarini, ASpampinato, S Synthesis and biological activity of some methoctramine-related tetraamines bearing a 11-acetyl-5,11-dihydro-6H-pyrido[2,3-b][1,4]-benzodiazepin-6-one moiety as antimuscarinics: a second generation of highly selective M2 muscarinic receptor antagonists. J Med Chem36:3734-7 (1993) 
 
Muscarinic acetylcholine receptor M2
Name:Muscarinic acetylcholine receptor M2
Type:Enzyme Catalytic Domain
Mol. Mass.:51555.53
Organism:RAT
Description:P10980
Residue:466
BDBM81900
NameBDBM81900
Synonyms:AQ-RA 741 NSC_129989
TypeSmall organic molecule
Emp. Form.C27H37N5O2
Mol. Mass.463.615
SMILESCCN(CC)CCCCC1CCN(CC(=O)N2c3ccccc3C(=O)Nc3cccnc23)CC1